Anope IRC Services

Please login or register.

Login with username, password and session length
Advanced search  

News:

Pages: [1]   Go Down

Author Topic: Build error v1.9.3  (Read 2884 times)

0 Members and 1 Guest are viewing this topic.

Andre

  • Anope User
  • Offline Offline
  • Posts: 1
Build error v1.9.3
« on: December 21, 2010, 10:30:11 AM »

Try to update to 1.9.3 but as i type make i get this:
The OS is Debian Lenny
Code: [Select]
make
[  1%] Built target version
[  1%] Generating version.h
[  1%] Built target headers
[  1%] Building CXX object src/CMakeFiles/services.dir/base.o
/usr/include/c++/4.3/bits/ostream_insert.h: In function ‘std::basic_ostream<_CharT, _Traits>& std::__ostream_insert(std::basic_ostream<_CharT, _Traits>&, const _CharT*, std::streamsize) [with _CharT = char, _Traits = std::char_traits<char>]’:
/usr/include/c++/4.3/bits/basic_string.h:2425:   instantiated from ‘std::basic_ostream<_CharT, _Traits>& std::operator<<(std::basic_ostream<_CharT, _Traits>&, const std::basic_string<_CharT, _Traits, _Alloc>&) [with _CharT = char, _Traits = std::char_traits<char>, _Alloc = std::allocator<char>]’
/home/chater/anope-1.9.3-source/include/anope.h:281:   instantiated from here
/usr/include/c++/4.3/bits/ostream_insert.h:83: error: invalid use of incomplete type ‘struct std::basic_ostream<char, std::char_traits<char> >’
/usr/include/c++/4.3/iosfwd:61: error: declaration of ‘struct std::basic_ostream<char, std::char_traits<char> >’
/usr/include/c++/4.3/bits/ostream_insert.h:85: error: invalid use of incomplete type ‘struct std::basic_ostream<char, std::char_traits<char> >’
/usr/include/c++/4.3/iosfwd:61: error: declaration of ‘struct std::basic_ostream<char, std::char_traits<char> >’
/usr/include/c++/4.3/bits/ostream_insert.h:85: error: invalid use of incomplete type ‘struct std::basic_ostream<char, std::char_traits<char> >’
/usr/include/c++/4.3/iosfwd:61: error: declaration of ‘struct std::basic_ostream<char, std::char_traits<char> >’
/usr/include/c++/4.3/bits/ostream_insert.h:90: error: invalid use of incomplete type ‘struct std::basic_ostream<char, std::char_traits<char> >’
/usr/include/c++/4.3/iosfwd:61: error: declaration of ‘struct std::basic_ostream<char, std::char_traits<char> >’
/usr/include/c++/4.3/bits/ostream_insert.h:95: error: invalid use of incomplete type ‘struct std::basic_ostream<char, std::char_traits<char> >’
/usr/include/c++/4.3/iosfwd:61: error: declaration of ‘struct std::basic_ostream<char, std::char_traits<char> >’
/usr/include/c++/4.3/bits/basic_string.h:2425:   instantiated from ‘std::basic_ostream<_CharT, _Traits>& std::operator<<(std::basic_ostream<_CharT, _Traits>&, const std::basic_string<_CharT, _Traits, _Alloc>&) [with _CharT = char, _Traits = std::char_traits<char>, _Alloc = std::allocator<char>]’
/home/chater/anope-1.9.3-source/include/anope.h:281:   instantiated from here
/usr/include/c++/4.3/bits/ostream_insert.h:98: error: invalid use of incomplete type ‘struct std::basic_ostream<char, std::char_traits<char> >’
/usr/include/c++/4.3/iosfwd:61: error: declaration of ‘struct std::basic_ostream<char, std::char_traits<char> >’
/usr/include/c++/4.3/bits/basic_string.h:2425:   instantiated from ‘std::basic_ostream<_CharT, _Traits>& std::operator<<(std::basic_ostream<_CharT, _Traits>&, const std::basic_string<_CharT, _Traits, _Alloc>&) [with _CharT = char, _Traits = std::char_traits<char>, _Alloc = std::allocator<char>]’
/home/chater/anope-1.9.3-source/include/anope.h:281:   instantiated from here
/usr/include/c++/4.3/bits/ostream_insert.h:100: error: invalid use of incomplete type ‘struct std::basic_ostream<char, std::char_traits<char> >’
/usr/include/c++/4.3/iosfwd:61: error: declaration of ‘struct std::basic_ostream<char, std::char_traits<char> >’
/usr/include/c++/4.3/bits/ostream_insert.h:105: error: invalid use of incomplete type ‘struct std::basic_ostream<char, std::char_traits<char> >’
/usr/include/c++/4.3/iosfwd:61: error: declaration of ‘struct std::basic_ostream<char, std::char_traits<char> >’
/usr/include/c++/4.3/bits/ostream_insert.h:109: error: invalid use of incomplete type ‘struct std::basic_ostream<char, std::char_traits<char> >’
/usr/include/c++/4.3/iosfwd:61: error: declaration of ‘struct std::basic_ostream<char, std::char_traits<char> >’
/usr/include/c++/4.3/bits/ostream_insert.h:113: error: invalid use of incomplete type ‘struct std::basic_ostream<char, std::char_traits<char> >’
/usr/include/c++/4.3/iosfwd:61: error: declaration of ‘struct std::basic_ostream<char, std::char_traits<char> >’
/usr/include/c++/4.3/bits/ostream_insert.h: In function ‘void std::__ostream_fill(std::basic_ostream<_CharT, _Traits>&, std::streamsize) [with _CharT = char, _Traits = std::char_traits<char>]’:
/usr/include/c++/4.3/bits/ostream_insert.h:97:   instantiated from ‘std::basic_ostream<_CharT, _Traits>& std::__ostream_insert(std::basic_ostream<_CharT, _Traits>&, const _CharT*, std::streamsize) [with _CharT = char, _Traits = std::char_traits<char>]’
/usr/include/c++/4.3/bits/basic_string.h:2425:   instantiated from ‘std::basic_ostream<_CharT, _Traits>& std::operator<<(std::basic_ostream<_CharT, _Traits>&, const std::basic_string<_CharT, _Traits, _Alloc>&) [with _CharT = char, _Traits = std::char_traits<char>, _Alloc = std::allocator<char>]’
/home/chater/anope-1.9.3-source/include/anope.h:281:   instantiated from here
/usr/include/c++/4.3/bits/ostream_insert.h:63: error: invalid use of incomplete type ‘struct std::basic_ostream<char, std::char_traits<char> >’
/usr/include/c++/4.3/iosfwd:61: error: declaration of ‘struct std::basic_ostream<char, std::char_traits<char> >’
/usr/include/c++/4.3/bits/ostream_insert.h:65: error: invalid use of incomplete type ‘struct std::basic_ostream<char, std::char_traits<char> >’
/usr/include/c++/4.3/iosfwd:61: error: declaration of ‘struct std::basic_ostream<char, std::char_traits<char> >’
/usr/include/c++/4.3/bits/ostream_insert.h:68: error: invalid use of incomplete type ‘struct std::basic_ostream<char, std::char_traits<char> >’
/usr/include/c++/4.3/iosfwd:61: error: declaration of ‘struct std::basic_ostream<char, std::char_traits<char> >’
/usr/include/c++/4.3/bits/ostream_insert.h:71: error: invalid use of incomplete type ‘struct std::basic_ostream<char, std::char_traits<char> >’
/usr/include/c++/4.3/iosfwd:61: error: declaration of ‘struct std::basic_ostream<char, std::char_traits<char> >’
/usr/include/c++/4.3/bits/ostream_insert.h: In function ‘void std::__ostream_write(std::basic_ostream<_CharT, _Traits>&, const _CharT*, std::streamsize) [with _CharT = char, _Traits = std::char_traits<char>]’:
/usr/include/c++/4.3/bits/ostream_insert.h:99:   instantiated from ‘std::basic_ostream<_CharT, _Traits>& std::__ostream_insert(std::basic_ostream<_CharT, _Traits>&, const _CharT*, std::streamsize) [with _CharT = char, _Traits = std::char_traits<char>]’
/usr/include/c++/4.3/bits/basic_string.h:2425:   instantiated from ‘std::basic_ostream<_CharT, _Traits>& std::operator<<(std::basic_ostream<_CharT, _Traits>&, const std::basic_string<_CharT, _Traits, _Alloc>&) [with _CharT = char, _Traits = std::char_traits<char>, _Alloc = std::allocator<char>]’
/home/chater/anope-1.9.3-source/include/anope.h:281:   instantiated from here
/usr/include/c++/4.3/bits/ostream_insert.h:51: error: invalid use of incomplete type ‘struct std::basic_ostream<char, std::char_traits<char> >’
/usr/include/c++/4.3/iosfwd:61: error: declaration of ‘struct std::basic_ostream<char, std::char_traits<char> >’
/usr/include/c++/4.3/bits/ostream_insert.h:53: error: invalid use of incomplete type ‘struct std::basic_ostream<char, std::char_traits<char> >’
/usr/include/c++/4.3/iosfwd:61: error: declaration of ‘struct std::basic_ostream<char, std::char_traits<char> >’
/usr/include/c++/4.3/bits/ostream_insert.h:55: error: invalid use of incomplete type ‘struct std::basic_ostream<char, std::char_traits<char> >’
/usr/include/c++/4.3/iosfwd:61: error: declaration of ‘struct std::basic_ostream<char, std::char_traits<char> >’
make[2]: *** [src/CMakeFiles/services.dir/base.o] Fehler 1
make[1]: *** [src/CMakeFiles/services.dir/all] Fehler 2
make: *** [all] Fehler 2
Just don't know the reason for that.
« Last Edit: December 21, 2010, 10:33:18 AM by Andre »
Logged

Adam

  • Team
  • *
  • Offline Offline
  • Posts: 463
Re: Build error v1.9.3
« Reply #1 on: May 08, 2011, 06:28:22 AM »

Logged
Pages: [1]   Go Up